Reaction Details
TargetMetabotropic glutamate receptor 5
LigandBDBM372971
Substrate/Competitorn/a
Meas. Tech.[3H]-M-MPEP Radioligand Binding Assay
Ki 10.0±n/a nM
Citation Christopher, JACongreve, MSAves, SJTehan, BG 4-(3-cyanophenyl)-6-pyridinylpyrimidine mGlu5 modulators US Patent US10246432 Publication Date 4/2/2019
 
Metabotropic glutamate receptor 5
Name:Metabotropic glutamate receptor 5
Type:Enzyme
Mol. Mass.:132484.72
Organism:Homo sapiens (Human)
Description:n/a
Residue:1212
BDBM372971
NameBDBM372971
Synonyms:3-chloro-4-fluoro-5-[6- US10584111, Ex No. 12 | US11584732, Example 12
TypeSmall organic molecule
Emp. Form.C14H6ClF2N5
Mol. Mass.317.681
SMILESFc1cnn(c1)-c1cc(ncn1)-c1cc(cc(Cl)c1F)C#N