Reaction Details
TargetHistamine H1 receptor
LigandBDBM22566
Substrate/CompetitorBDBM22567
Meas. Tech.Radioligand Binding Assay
pH7.5±n/a
Temperature298.15±n/a K
Ki>10000±n/a nM
Citation Thurmond, RLDesai, PJDunford, PJFung-Leung, WPHofstra, CLJiang, WNguyen, SRiley, JPSun, SWilliams, KNEdwards, JPKarlsson, L A potent and selective histamine H4 receptor antagonist with anti-inflammatory properties. J Pharmacol Exp Ther309:404-13 (2004) 
 
Histamine H1 receptor
Name:Histamine H1 receptor
Type:G Protein-Coupled Receptor (GPCR)
Mol. Mass.:55808.72
Organism:Homo sapiens (Human)
Description:Cell pellets from SK-N-MC cells transfected with human H1 receptor were used in binding assay.
Residue:487
BDBM22566
BDBM22567
NameBDBM22566
Synonyms:5-chloro-2-[(4-methylpiperazin-1-yl)carbonyl]-1H-indole JNJ 7777120
TypeSmall organic molecule
Emp. Form.C14H16ClN3O
Mol. Mass.277.749
SMILESCN1CCN(CC1)C(=O)c1cc2cc(Cl)ccc2[nH]1