Reaction Details
TargetCoagulation factor XII
LigandBDBM22738
Substrate/CompetitorBDBM22723
Meas. Tech.Enzyme Inhibition Assay
pH7.4±n/a
Temperature298.15±n/a K
Ki 22.8±3.9 nM
Citation Wadkins, RMHyatt, JLWei, XYoon, KJWierdl, MEdwards, CCMorton, CLObenauer, JCDamodaran, KBeroza, PDanks, MKPotter, PM Identification and characterization of novel benzil (diphenylethane-1,2-dione) analogues as inhibitors of mammalian carboxylesterases. J Med Chem48:2906-15 (2005) 
 
Coagulation factor XII
Name:Coagulation factor XII
Type:Enzyme
Mol. Mass.:67810.07
Organism:Homo sapiens (Human)
Description:P00748
Residue:615
BDBM22738
BDBM22723
NameBDBM22738
Synonyms:1-(4-chlorophenyl)-2-(4-methylphenyl)ethane-1,2-dione | Benzil-based compound, 16
TypeSmall organic molecule
Emp. Form.C15H11ClO2
Mol. Mass.258.7
SMILESCc1ccc(cc1)C(=O)C(=O)c1ccc(Cl)cc1