Reaction Details
TargetCoagulation factor XII
LigandBDBM22743
Substrate/CompetitorBDBM22723
Meas. Tech.Enzyme Inhibition Assay
pH7.4±n/a
Temperature298.15±n/a K
Ki 70.2±1.1 nM
Citation Wadkins, RMHyatt, JLWei, XYoon, KJWierdl, MEdwards, CCMorton, CLObenauer, JCDamodaran, KBeroza, PDanks, MKPotter, PM Identification and characterization of novel benzil (diphenylethane-1,2-dione) analogues as inhibitors of mammalian carboxylesterases. J Med Chem48:2906-15 (2005) 
 
Coagulation factor XII
Name:Coagulation factor XII
Type:Enzyme
Mol. Mass.:67810.07
Organism:Homo sapiens (Human)
Description:P00748
Residue:615
BDBM22743
BDBM22723
NameBDBM22743
Synonyms:1,2-bis(4-methoxyphenyl)ethane-1,2-dione JMC505727 Compound 2
TypeSmall organic molecule
Emp. Form.C16H14O4
Mol. Mass.270.28
SMILESCOc1ccc(cc1)C(=O)C(=O)c1ccc(OC)cc1