Reaction Details
TargetLiver carboxylesterase 1
LigandBDBM22732
Substrate/CompetitorBDBM22723
Meas. Tech.Enzyme Inhibition Assay
Ki 220±n/a nM
Citation Wadkins, RMHyatt, JLWei, XYoon, KJWierdl, MEdwards, CCMorton, CLObenauer, JCDamodaran, KBeroza, PDanks, MKPotter, PM Identification and characterization of novel benzil (diphenylethane-1,2-dione) analogues as inhibitors of mammalian carboxylesterases. J Med Chem48:2906-15 (2005) 
 
Liver carboxylesterase 1
Name:Liver carboxylesterase 1
Type:Enzyme
Mol. Mass.:62292
Organism:Oryctolagus cuniculus (rabbit)
Description:n/a
Residue:565
BDBM22732
BDBM22723
NameBDBM22732
Synonyms:1,2-bis(2-chlorophenyl)ethane-1,2-dione | Benzil-based compound, 10
TypeSmall organic molecule
Emp. Form.C14H8Cl2O2
Mol. Mass.279.118
SMILESClc1ccccc1C(=O)C(=O)c1ccccc1Cl