Reaction Details
TargetLiver carboxylesterase 1
LigandBDBM22734
Substrate/CompetitorBDBM22723
Meas. Tech.Enzyme Inhibition Assay
Ki 17.5±n/a nM
Citation Wadkins, RMHyatt, JLWei, XYoon, KJWierdl, MEdwards, CCMorton, CLObenauer, JCDamodaran, KBeroza, PDanks, MKPotter, PM Identification and characterization of novel benzil (diphenylethane-1,2-dione) analogues as inhibitors of mammalian carboxylesterases. J Med Chem48:2906-15 (2005) 
 
Liver carboxylesterase 1
Name:Liver carboxylesterase 1
Type:Enzyme
Mol. Mass.:62292
Organism:Oryctolagus cuniculus (rabbit)
Description:n/a
Residue:565
BDBM22734
BDBM22723
NameBDBM22734
Synonyms:1,2-bis(3,5-difluorophenyl)ethane-1,2-dione CHEMBL193229
TypeSmall organic molecule
Emp. Form.C14H6F4O2
Mol. Mass.282.1899
SMILESFc1cc(F)cc(c1)C(=O)C(=O)c1cc(F)cc(F)c1