Reaction Details
TargetLiver carboxylesterase 1
LigandBDBM22746
Substrate/CompetitorBDBM22723
Meas. Tech.Enzyme Inhibition Assay
Ki 15.0±n/a nM
Citation Wadkins, RMHyatt, JLWei, XYoon, KJWierdl, MEdwards, CCMorton, CLObenauer, JCDamodaran, KBeroza, PDanks, MKPotter, PM Identification and characterization of novel benzil (diphenylethane-1,2-dione) analogues as inhibitors of mammalian carboxylesterases. J Med Chem48:2906-15 (2005) 
 
Liver carboxylesterase 1
Name:Liver carboxylesterase 1
Type:Enzyme
Mol. Mass.:62292
Organism:Oryctolagus cuniculus (rabbit)
Description:n/a
Residue:565
BDBM22746
BDBM22723
NameBDBM22746
Synonyms:1-[4-(bromomethyl)phenyl]-2-phenylethane-1,2-dione | Benzil-based compound, 24
TypeSmall organic molecule
Emp. Form.C15H11BrO2
Mol. Mass.303.151
SMILESBrCc1ccc(cc1)C(=O)C(=O)c1ccccc1