Reaction Details
TargetEpidermal growth factor receptor [G719C]
LigandBDBM373711
Substrate/Competitorn/a
Meas. Tech.Kinase assay
Kd 50±n/a nM
Citation Mansour, TS 1,2-dithiolane and dithiol compounds useful in treating mutant EGFR-mediated diseases and conditions US Patent US10246444 Publication Date 4/2/2019
 
Epidermal growth factor receptor [G719C]
Name:Epidermal growth factor receptor [G719C]
Type:Tyrosine-protein kinase
Mol. Mass.:134325.68
Organism:Homo sapiens (Human)
Description:gi_29725609
Residue:1210
BDBM373711
NameBDBM373711
Synonyms:US10246444, Example 40
TypeSmall organic molecule
Emp. Form.C30H26ClFN4O3S2
Mol. Mass.609.134
SMILESCCOc1cc2ncc(C#N)c(Nc3ccc(OCc4cccc(F)c4)c(Cl)c3)c2cc1NC(=O)CC1CCSS1