Reaction Details
TargetTyrosine-protein kinase BTK
LigandBDBM374602
Substrate/Competitorn/a
Meas. Tech.25P Btk Enzyme Activity Assay
IC50 0.160±n/a nM
Citation Siu, TAltman, MDAndresen, BMLiu, JKozlowski, JBoga, SBYu, YAnand, RCai, JWang, DLiu, S Indazole and azaindazole Btk inhibitors US Patent US10246457 Publication Date 4/2/2019
 
Tyrosine-protein kinase BTK
Name:Tyrosine-protein kinase BTK
Type:Enzyme
Mol. Mass.:76289.95
Organism:Homo sapiens (Human)
Description:Q06187
Residue:659
BDBM374602
NameBDBM374602
Synonyms:3-amino-5-[3-(6-tert-butyl-8-fluoro-1-oxophthalazin-2(1H)-yl)-2-(hydroxymethyl)phenyl]-N-methyl-1H-indazole-7-carboxamide | US10246457, Example 11
TypeSmall organic molecule
Emp. Form.C28H27FN6O3
Mol. Mass.514.5508
SMILESCNC(=O)c1cc(cc2c(N)n[nH]c12)-c1cccc(c1CO)-n1ncc2cc(cc(F)c2c1=O)C(C)(C)C