Reaction Details
TargetTyrosine-protein kinase BTK
LigandBDBM374609
Substrate/Competitorn/a
Meas. Tech.25P Btk Enzyme Activity Assay
IC50 0.130±n/a nM
Citation Siu, TAltman, MDAndresen, BMLiu, JKozlowski, JBoga, SBYu, YAnand, RCai, JWang, DLiu, S Indazole and azaindazole Btk inhibitors US Patent US10246457 Publication Date 4/2/2019
 
Tyrosine-protein kinase BTK
Name:Tyrosine-protein kinase BTK
Type:Enzyme
Mol. Mass.:76289.95
Organism:Homo sapiens (Human)
Description:Q06187
Residue:659
BDBM374609
NameBDBM374609
Synonyms:US10246457, Example 18
TypeSmall organic molecule
Emp. Form.C27H26N6O2S
Mol. Mass.498.599
SMILESCn1cc(cn1)-c1cc(cc2c(N)n[nH]c12)-c1cccc(NC(=O)c2cc3CCCCc3s2)c1CO