Reaction Details
TargetL-lactate dehydrogenase
LigandBDBM23224
Substrate/CompetitorBDBM19473
Meas. Tech.Lactate Dehydrogenase Inhibition Assay
pH7±n/a
Temperature298.15±n/a K
IC50 87300±1900 nM
Citation Choi, SRPradhan, AHammond, NLChittiboyina, AGTekwani, BLAvery, MA Design, synthesis, and biological evaluation of Plasmodium falciparum lactate dehydrogenase inhibitors. J Med Chem50:3841-50 (2007) 
 
L-lactate dehydrogenase
Name:L-lactate dehydrogenase
Type:Oxidoreductase
Mol. Mass.:34111.90
Organism:Plasmodium falciparum
Description:n/a
Residue:316
BDBM23224
BDBM19473
NameBDBM23224
Synonyms:7-{[4-(formamidoformic acid)-3-methoxyphenyl]methoxy}-5-hydroxy-4-oxo-4H-chromene-2-carboxylic acid | Oxamic acid derivative, 1
TypeSmall organic molecule
Emp. Form.C20H15NO10
Mol. Mass.429.3338
SMILESCOc1cc(COc2cc(O)c3c(c2)oc(cc3=O)C(O)=O)ccc1NC(=O)C(O)=O