Reaction Details
TargetL-lactate dehydrogenase B chain
LigandBDBM23222
Substrate/CompetitorBDBM19473
Meas. Tech.Lactate Dehydrogenase Inhibition Assay
pH7±n/a
Temperature298.15±n/a K
IC50 123000±20600 nM
Citation Choi, SRPradhan, AHammond, NLChittiboyina, AGTekwani, BLAvery, MA Design, synthesis, and biological evaluation of Plasmodium falciparum lactate dehydrogenase inhibitors. J Med Chem50:3841-50 (2007) 
 
L-lactate dehydrogenase B chain
Name:L-lactate dehydrogenase B chain
Type:Oxidoreductase; homotetramer
Mol. Mass.:36722.72
Organism:Bos taurus (bovine)
Description:Purified from bovine heart.
Residue:334
BDBM23222
BDBM19473
NameBDBM23222
Synonyms:Oxalamic acid Oxamate, 3 carbamoylformic acid
TypeSmall organic molecule
Emp. Form.C2H3NO3
Mol. Mass.89.0501
SMILESNC(=O)C(O)=O