Reaction Details
TargetL-lactate dehydrogenase B chain
LigandBDBM23225
Substrate/CompetitorBDBM19473
Meas. Tech.Lactate Dehydrogenase Inhibition Assay
pH7±n/a
Temperature298.15±n/a K
IC50>241000±n/a nM
Citation Choi, SRPradhan, AHammond, NLChittiboyina, AGTekwani, BLAvery, MA Design, synthesis, and biological evaluation of Plasmodium falciparum lactate dehydrogenase inhibitors. J Med Chem50:3841-50 (2007) 
 
L-lactate dehydrogenase B chain
Name:L-lactate dehydrogenase B chain
Type:Oxidoreductase; homotetramer
Mol. Mass.:36722.72
Organism:Bos taurus (bovine)
Description:Purified from bovine heart.
Residue:334
BDBM23225
BDBM19473
NameBDBM23225
Synonyms:7-{2-[4-(formamidoformic acid)phenyl]ethoxy}-5-hydroxy-4-oxo-4H-chromene-2-carboxylic acid | Oxamic acid derivative, 2
TypeSmall organic molecule
Emp. Form.C20H15NO9
Mol. Mass.413.3344
SMILESOC(=O)C(=O)Nc1ccc(CCOc2cc(O)c3c(c2)oc(cc3=O)C(O)=O)cc1