Reaction Details
TargetL-lactate dehydrogenase
LigandBDBM23229
Substrate/CompetitorBDBM23230
Meas. Tech.Lactate Dehydrogenase Inhibition Assay
IC50 2660±n/a nM
Citation Choi, SRPradhan, AHammond, NLChittiboyina, AGTekwani, BLAvery, MA Design, synthesis, and biological evaluation of Plasmodium falciparum lactate dehydrogenase inhibitors. J Med Chem50:3841-50 (2007) 
 
L-lactate dehydrogenase
Name:L-lactate dehydrogenase
Type:Oxidoreductase
Mol. Mass.:34043.75
Organism:Plasmodium falciparum
Description:n/a
Residue:313
BDBM23229
BDBM23230
NameBDBM23229
Synonyms:Oxamic acid derivative, 7 | [(4-{2-[(5-hydroxy-2-{[(4-methoxyphenyl)methyl]carbamoyl}-4-oxo-4H-chromen-7-yl)oxy]ethyl}-2-methoxyphenyl)carbamoyl]formic acid
TypeSmall organic molecule
Emp. Form.C29H26N2O10
Mol. Mass.562.5241
SMILESCOc1ccc(CNC(=O)c2cc(=O)c3c(O)cc(OCCc4ccc(NC(=O)C(O)=O)c(OC)c4)cc3o2)cc1