Reaction Details
TargetMalate dehydrogenase, mitochondrial
LigandBDBM23224
Substrate/CompetitorBDBM23230
Meas. Tech.Lactate Dehydrogenase Inhibition Assay
IC50 64000±n/a nM
Citation Choi, SRPradhan, AHammond, NLChittiboyina, AGTekwani, BLAvery, MA Design, synthesis, and biological evaluation of Plasmodium falciparum lactate dehydrogenase inhibitors. J Med Chem50:3841-50 (2007) 
 
Malate dehydrogenase, mitochondrial
Name:Malate dehydrogenase, mitochondrial
Type:Oxidoreductase; homodimer
Mol. Mass.:35493.48
Organism:Sus scrofa (pig)
Description:Porcine heart mitochondria.
Residue:337
BDBM23224
BDBM23230
NameBDBM23224
Synonyms:7-{[4-(formamidoformic acid)-3-methoxyphenyl]methoxy}-5-hydroxy-4-oxo-4H-chromene-2-carboxylic acid | Oxamic acid derivative, 1
TypeSmall organic molecule
Emp. Form.C20H15NO10
Mol. Mass.429.3338
SMILESCOc1cc(COc2cc(O)c3c(c2)oc(cc3=O)C(O)=O)ccc1NC(=O)C(O)=O