Reaction Details
TargetTyrosine-protein kinase SYK
LigandBDBM140380
Substrate/Competitorn/a
Meas. Tech.GSK Kinase Assay
IC50 1.000±n/a nM
Citation Dahmann, GHoffmann, MKlicic, JLamb, DJMcCarthy, CNapier, SCParrish, KScott, JFitzgerald, JLWalker, E Heteroaryl Syk inhibitors US Patent US9914735 Publication Date 3/13/2018
 
Tyrosine-protein kinase SYK
Name:Tyrosine-protein kinase SYK
Type:Enzyme
Mol. Mass.:72079.99
Organism:Homo sapiens (Human)
Description:P43405
Residue:635
BDBM140380
NameBDBM140380
Synonyms:US10947243, Example 105 US9914735, Example 105
TypeSmall organic molecule
Emp. Form.C24H24N4O2
Mol. Mass.400.473
SMILESC[C@@H](Oc1cc(cc2ncccc12)-c1ccc2n(C)c(C)nc2c1)[C@H]1CNC(=O)C1