Reaction Details
TargetNeutrophil elastase
LigandBDBM23700
Substrate/CompetitorBDBM23699
Meas. Tech.Human Neutrophil Elastase Inhibition Assay
pH7.5±n/a
Temperature298.15±n/a K
Ki 15±n/a nM
Citation Schepetkin, IAKhlebnikov, AIQuinn, MT N-benzoylpyrazoles are novel small-molecule inhibitors of human neutrophil elastase. J Med Chem50:4928-38 (2007) 
 
Neutrophil elastase
Name:Neutrophil elastase
Type:Enzyme
Mol. Mass.:28532.38
Organism:Homo sapiens (Human)
Description:P08246
Residue:267
BDBM23700
BDBM23699
NameBDBM23700
Synonyms:N-Benzoylpyrazole deriv., 2 | methyl 1-[(4-chlorophenyl)carbonyl]-1H-pyrazole-5-carboxylate
TypeSmall organic molecule
Emp. Form.C12H9ClN2O3
Mol. Mass.264.664
SMILESCOC(=O)c1ccnn1C(=O)c1ccc(Cl)cc1