Reaction Details
TargetNeutrophil elastase
LigandBDBM23702
Substrate/CompetitorBDBM23699
Meas. Tech.Human Neutrophil Elastase Inhibition Assay
pH7.5±n/a
Temperature298.15±n/a K
Ki 24±n/a nM
Citation Schepetkin, IAKhlebnikov, AIQuinn, MT N-benzoylpyrazoles are novel small-molecule inhibitors of human neutrophil elastase. J Med Chem50:4928-38 (2007) 
 
Neutrophil elastase
Name:Neutrophil elastase
Type:Enzyme
Mol. Mass.:28532.38
Organism:Homo sapiens (Human)
Description:P08246
Residue:267
BDBM23702
BDBM23699
NameBDBM23702
Synonyms:3-[(2,4-dimethylphenyl)carbonyl]-1-[(4-fluorophenyl)carbonyl]-1H-pyrazole | N-Benzoylpyrazole deriv., 4
TypeSmall organic molecule
Emp. Form.C19H15FN2O2
Mol. Mass.322.333
SMILESCc1ccc(C(=O)c2ccn(n2)C(=O)c2ccc(F)cc2)c(C)c1