Reaction Details
TargetNeutrophil elastase
LigandBDBM23714
Substrate/CompetitorBDBM23699
Meas. Tech.Human Neutrophil Elastase Inhibition Assay
pH7.5±n/a
Temperature298.15±n/a K
Ki 250±n/a nM
Citation Schepetkin, IAKhlebnikov, AIQuinn, MT N-benzoylpyrazoles are novel small-molecule inhibitors of human neutrophil elastase. J Med Chem50:4928-38 (2007) 
 
Neutrophil elastase
Name:Neutrophil elastase
Type:Enzyme
Mol. Mass.:28532.38
Organism:Homo sapiens (Human)
Description:P08246
Residue:267
BDBM23714
BDBM23699
NameBDBM23714
Synonyms:4-bromo-1-[(3-methylphenyl)carbonyl]-1H-pyrazole | N-Benzoylpyrazole deriv., 22
TypeSmall organic molecule
Emp. Form.C11H9BrN2O
Mol. Mass.265.106
SMILESCc1cccc(c1)C(=O)n1cc(Br)cn1