Reaction Details
TargetChymotrypsin-C
LigandBDBM23704
Substrate/CompetitorBDBM23729
Meas. Tech.Human Neutrophil Elastase Inhibition Assay
IC50 57±n/a nM
Citation Schepetkin, IAKhlebnikov, AIQuinn, MT N-benzoylpyrazoles are novel small-molecule inhibitors of human neutrophil elastase. J Med Chem50:4928-38 (2007) 
 
Chymotrypsin-C
Name:Chymotrypsin-C
Type:Enzyme
Mol. Mass.:29487.98
Organism:Homo sapiens (Human)
Description:Q99895
Residue:268
BDBM23704
BDBM23729
NameBDBM23704
Synonyms:1-benzoyl-N-phenyl-1H-pyrazole-3-carboxamide | N-Benzoylpyrazole deriv., 6
TypeSmall organic molecule
Emp. Form.C17H13N3O2
Mol. Mass.291.304
SMILESO=C(Nc1ccccc1)c1ccn(n1)C(=O)c1ccccc1