Reaction Details
TargetChymotrypsin-C
LigandBDBM23710
Substrate/CompetitorBDBM23729
Meas. Tech.Human Neutrophil Elastase Inhibition Assay
IC50 190±n/a nM
Citation Schepetkin, IAKhlebnikov, AIQuinn, MT N-benzoylpyrazoles are novel small-molecule inhibitors of human neutrophil elastase. J Med Chem50:4928-38 (2007) 
 
Chymotrypsin-C
Name:Chymotrypsin-C
Type:Enzyme
Mol. Mass.:29487.98
Organism:Homo sapiens (Human)
Description:Q99895
Residue:268
BDBM23710
BDBM23729
NameBDBM23710
Synonyms:1-[(4-methylphenyl)carbonyl]-3-nitro-1H-pyrazole | N-Benzoylpyrazole deriv., 18
TypeSmall organic molecule
Emp. Form.C11H9N3O3
Mol. Mass.231.2075
SMILESCc1ccc(cc1)C(=O)n1ccc(n1)[N+]([O-])=O