Reaction Details
TargetChymotrypsin-C
LigandBDBM23713
Substrate/CompetitorBDBM23729
Meas. Tech.Human Neutrophil Elastase Inhibition Assay
IC50 4700±n/a nM
Citation Schepetkin, IAKhlebnikov, AIQuinn, MT N-benzoylpyrazoles are novel small-molecule inhibitors of human neutrophil elastase. J Med Chem50:4928-38 (2007) 
 
Chymotrypsin-C
Name:Chymotrypsin-C
Type:Enzyme
Mol. Mass.:29487.98
Organism:Homo sapiens (Human)
Description:Q99895
Residue:268
BDBM23713
BDBM23729
NameBDBM23713
Synonyms:4-chloro-1-[(2-methylphenyl)carbonyl]-1H-pyrazole | N-Benzoylpyrazole deriv., 21
TypeSmall organic molecule
Emp. Form.C11H9ClN2O
Mol. Mass.220.655
SMILESCc1ccccc1C(=O)n1cc(Cl)cn1