Reaction Details
TargetChymotrypsin-C
LigandBDBM23715
Substrate/CompetitorBDBM23729
Meas. Tech.Human Neutrophil Elastase Inhibition Assay
IC50 2300±n/a nM
Citation Schepetkin, IAKhlebnikov, AIQuinn, MT N-benzoylpyrazoles are novel small-molecule inhibitors of human neutrophil elastase. J Med Chem50:4928-38 (2007) 
 
Chymotrypsin-C
Name:Chymotrypsin-C
Type:Enzyme
Mol. Mass.:29487.98
Organism:Homo sapiens (Human)
Description:Q99895
Residue:268
BDBM23715
BDBM23729
NameBDBM23715
Synonyms:4-bromo-1-[(2-methylphenyl)carbonyl]-1H-pyrazole | N-Benzoylpyrazole deriv., 23
TypeSmall organic molecule
Emp. Form.C11H9BrN2O
Mol. Mass.265.106
SMILESCc1ccccc1C(=O)n1cc(Br)cn1