Reaction Details
TargetNeutrophil elastase
LigandBDBM23730
Substrate/CompetitorBDBM23699
Meas. Tech.Human Neutrophil Elastase Inhibition Assay
Ki 1600±n/a nM
Citation Schepetkin, IAKhlebnikov, AIQuinn, MT N-benzoylpyrazoles are novel small-molecule inhibitors of human neutrophil elastase. J Med Chem50:4928-38 (2007) 
 
Neutrophil elastase
Name:Neutrophil elastase
Type:Enzyme
Mol. Mass.:28532.38
Organism:Homo sapiens (Human)
Description:P08246
Residue:267
BDBM23730
BDBM23699
NameBDBM23730
Synonyms:1,2,4-triazole-5-carboxylate, 14 methyl 3-{[2-(1,3-dioxo-1,3-dihydro-2H-isoindol-2-yl)-3-methylbutanoyl]amino}-1H-1,2,4-triazole-5-carboxylate
TypeSmall organic molecule
Emp. Form.C17H17N5O5
Mol. Mass.371.3474
SMILESCOC(=O)c1nnc(NC(=O)C(C(C)C)N2C(=O)c3ccccc3C2=O)[nH]1