Reaction Details
TargetSerine/threonine-protein kinase pim-1
LigandBDBM376787
Substrate/Competitorn/a
Meas. Tech.Enzyme Assay
IC50<10±n/a nM
Citation Vechorkin, OLi, YSokolsky, AWang, AZhu, WZhuo, J Heterocyclic compounds useful as pim kinase inhibitors US Patent US9920032 Publication Date 3/20/2018
 
Serine/threonine-protein kinase pim-1
Name:Serine/threonine-protein kinase pim-1
Type:Protein
Mol. Mass.:35681.82
Organism:Homo sapiens (Human)
Description:P11309
Residue:313
BDBM376787
NameBDBM376787
Synonyms:N-(4-((1R,3S,5S)-3-Amino-5-methylcyclohexyl)pyridin-3-yl)-5-fluoro-3-(3-methoxy-3-methylazetidin-1-yl)quinoline-8-carboxamide US11053215, Example 118 | US9920032, Example 118
TypeSmall organic molecule
Emp. Form.C27H32FN5O2
Mol. Mass.477.5737
SMILESCOC1(C)CN(C1)c1cnc2c(ccc(F)c2c1)C(=O)Nc1cnccc1[C@@H]1C[C@H](C)C[C@H](N)C1