Reaction Details
TargetSerine/threonine-protein kinase pim-2
LigandBDBM376821
Substrate/Competitorn/a
Meas. Tech.Kinase Assay
IC50<100±n/a nM
Citation Vechorkin, OLi, YSokolsky, AWang, AZhu, WZhuo, J Heterocyclic compounds useful as pim kinase inhibitors US Patent US9920032 Publication Date 3/20/2018
 
Serine/threonine-protein kinase pim-2
Name:Serine/threonine-protein kinase pim-2
Type:Serine/threonine-protein kinase
Mol. Mass.:34185.93
Organism:Homo sapiens (Human)
Description:Q9P1W9
Residue:311
BDBM376821
NameBDBM376821
Synonyms:N-(4-((1R,3S,5S)-3-Amino-5-methylcyclohexyl)pyridin-3-yl)-5-fluoro-3-((2-methoxyphenyl)(methyl)amino)quinoline-8-carboxamide US11053215, Example 152 | US9920032, Example 152
TypeSmall organic molecule
Emp. Form.C30H32FN5O2
Mol. Mass.513.6058
SMILESCOc1ccccc1N(C)c1cnc2c(ccc(F)c2c1)C(=O)Nc1cnccc1[C@@H]1C[C@H](C)C[C@H](N)C1