Reaction Details
TargetOrexin/Hypocretin receptor type 1
LigandBDBM376840
Substrate/Competitorn/a
Meas. Tech.FLIPR Assay
IC50 18.0±n/a nM
Citation Kuduk, SDLiverton, NLuo, Y Methyl oxazole orexin receptor antagonists US Patent US9920038 Publication Date 3/20/2018
 
Orexin/Hypocretin receptor type 1
Name:Orexin/Hypocretin receptor type 1
Type:Protein
Mol. Mass.:46817.55
Organism:Rattus norvegicus (Rat)
Description:P56718
Residue:416
BDBM376840
NameBDBM376840
Synonyms:US9920038, 1
TypeSmall organic molecule
Emp. Form.C22H27N5O3
Mol. Mass.409.4815
SMILESCc1oc(C[C@H]2CCCCN2C(=O)c2ccccc2-n2nccn2)nc1C(C)(C)O