Reaction Details
TargetNuclear receptor ROR-gamma
LigandBDBM189895
Substrate/Competitorn/a
IC50 2.70±n/a nM
Citation Schnute, ME Methyl- and trifluoromethyl-substituted pyrrolopyridine modulators of RORC2 and methods of use thereof US Patent US9920054 Publication Date 3/20/2018
 
Nuclear receptor ROR-gamma
Name:Nuclear receptor ROR-gamma
Type:Enzyme Catalytic Domain
Mol. Mass.:58218.40
Organism:Homo sapiens (Human)
Description:P51449
Residue:518
BDBM189895
NameBDBM189895
Synonyms:US10227346, Example 22 US9670201, 22 (S)-3-cyano-N-(1-methyl-4-(trifluoromethyl)-3-(1-(2,3,3-trimethylbutanoyl)piperidin-4-yl)-1H-pyrrolo[2,3-b]pyridin-5-yl)benzamide | US9920054, Example 22
TypeSmall organic molecule
Emp. Form.C29H32F3N5O2
Mol. Mass.539.5919
SMILESC[C@H](C(=O)N1CCC(CC1)c1cn(C)c2ncc(NC(=O)c3cccc(c3)C#N)c(c12)C(F)(F)F)C(C)(C)C