Reaction Details
TargetALK tyrosine kinase receptor [L1196M]
LigandBDBM261651
Substrate/Competitorn/a
Meas. Tech.ELISA-Based in vitro Kinase Assay
pH7.5±n/a
Temperature298.15±n/a K
IC50 55.6±n/a nM
Commentsextracted
Citation Gambacorti-Passerini, CMologni, LScapozza, LBisson, WGoekjian, PD Attoma, J 2-acylaminothiazoles for the treatment of cancer US Patent US9708279 Publication Date 7/18/2017
 
ALK tyrosine kinase receptor [L1196M]
Name:ALK tyrosine kinase receptor [L1196M]
Type:n/a
Mol. Mass.:176471.13
Organism:Homo sapiens (Human)
Description:Q9UM73[L1196M]
Residue:1620
BDBM261651
NameBDBM261651
Synonyms:5-(4-(4-methylpiperazine-1-carbonyl)phenyl)-N-(4-(3-(3-((triisopropylsilyl)oxy)prop-1-yn-1-yl)phenyl)thiazol-2-yl)furan-2-carboxamide | US9708279, 28
TypeSmall organic molecule
Emp. Form.C38H46N4O4SSi
Mol. Mass.682.947
SMILESCC(C)[Si](OCC#Cc1cccc(c1)-c1csc(NC(=O)c2ccc(o2)-c2ccc(cc2)C(=O)N2CCN(C)CC2)n1)(C(C)C)C(C)C