Reaction Details
TargetALK tyrosine kinase receptor [L1196M]
LigandBDBM261652
Substrate/Competitorn/a
Meas. Tech.ELISA-Based in vitro Kinase Assay
pH7.5±n/a
Temperature298.15±n/a K
IC50 46.7±n/a nM
Commentsextracted
Citation Gambacorti-Passerini, CMologni, LScapozza, LBisson, WGoekjian, PD Attoma, J 2-acylaminothiazoles for the treatment of cancer US Patent US9708279 Publication Date 7/18/2017
 
ALK tyrosine kinase receptor [L1196M]
Name:ALK tyrosine kinase receptor [L1196M]
Type:n/a
Mol. Mass.:176471.13
Organism:Homo sapiens (Human)
Description:Q9UM73[L1196M]
Residue:1620
BDBM261652
NameBDBM261652
Synonyms:5-(4-(4-methylpiperazine-1-carbonyl)phenyl)-N-(4-(3-((2-(trifluoromethyl)phenyl)ethynyl)phenyl)thiazol-2-yl)furan-2-carboxamide | US9708279, 29
TypeSmall organic molecule
Emp. Form.C35H27F3N4O3S
Mol. Mass.640.674
SMILESCN1CCN(CC1)C(=O)c1ccc(cc1)-c1ccc(o1)C(=O)Nc1nc(cs1)-c1cccc(c1)C#Cc1ccccc1C(F)(F)F