Reaction Details
TargetTyrosine-protein kinase ABL2
LigandBDBM378885
Substrate/Competitorn/a
Meas. Tech.Kinase Inhibition Assays
IC50 4.00±n/a nM
Citation Yang, SWei, Y 3-acetylenyl-pyrazole-pyrimidine derivative, and preparation method therefor and uses thereof US Patent US10266537 Publication Date 4/23/2019
 
Tyrosine-protein kinase ABL2
Name:Tyrosine-protein kinase ABL2
Type:PROTEIN
Mol. Mass.:128360.63
Organism:Homo sapiens (Human)
Description:ChEMBL_325082
Residue:1182
BDBM378885
NameBDBM378885
Synonyms:US10266537, Compound 93
TypeSmall organic molecule
Emp. Form.C29H27F3N6O2
Mol. Mass.548.5589
SMILESCc1ccc(NC(=O)c2ccc(C)c(c2)C(F)(F)F)cc1C#Cc1nn([C@H]2CC[C@H](O)CC2)c2ncnc(N)c12