Reaction Details
TargetMitotic checkpoint serine/threonine-protein kinase BUB1
LigandBDBM378958
Substrate/Competitorn/a
Meas. Tech.Bub1 Kinase Assay
IC50 5.60±n/a nM
Citation Hitchcock, MMengel, APütter, VSiemeister, GWengner, AMBriem, HEis, KSchulze, VFernandez-Montalvan, AEPrechtl, SHolton, SFanghänel, JLienau, PPreusse, CGnoth, MJ Substituted benzylindazoles for use as Bub1 kinase inhibitors in the treatment of hyperproliferative diseases US Patent US10266548 Publication Date 4/23/2019
 
Mitotic checkpoint serine/threonine-protein kinase BUB1
Name:Mitotic checkpoint serine/threonine-protein kinase BUB1
Type:PROTEIN
Mol. Mass.:122372.31
Organism:Homo sapiens (Human)
Description:ChEMBL_1510603
Residue:1085
BDBM378958
NameBDBM378958
Synonyms:2-{1-[4- (difluoro- methoxy)-2,6- difluorobenzyl]- 1H-indazol-3-yl}- 5-methoxy-N- (pyridin-4- yl)pyrimidin-4- amine | US10266548, Example 2-39-1
TypeSmall organic molecule
Emp. Form.C25H18F4N6O2
Mol. Mass.510.443
SMILESCOc1cnc(nc1Nc1ccncc1)-c1nn(Cc2c(F)cc(OC(F)F)cc2F)c2ccccc12