Reaction Details
TargetMitotic checkpoint serine/threonine-protein kinase BUB1
LigandBDBM378995
Substrate/Competitorn/a
Meas. Tech.Bub1 Kinase Assay
IC50 2.40±n/a nM
Citation Hitchcock, MMengel, APütter, VSiemeister, GWengner, AMBriem, HEis, KSchulze, VFernandez-Montalvan, AEPrechtl, SHolton, SFanghänel, JLienau, PPreusse, CGnoth, MJ Substituted benzylindazoles for use as Bub1 kinase inhibitors in the treatment of hyperproliferative diseases US Patent US10266548 Publication Date 4/23/2019
 
Mitotic checkpoint serine/threonine-protein kinase BUB1
Name:Mitotic checkpoint serine/threonine-protein kinase BUB1
Type:PROTEIN
Mol. Mass.:122372.31
Organism:Homo sapiens (Human)
Description:ChEMBL_1510603
Residue:1085
BDBM378995
NameBDBM378995
Synonyms:Preparation of {3-[({2-[1-(4-ethoxy-2,6-difluorobenzyl)-1H-indazol-3-yl]-4-(pyridin-4-ylamino)pyrimidin-5-yl}oxy)methyl]oxetan-3-yl}methanol | US10266548, Example 4-1
TypeSmall organic molecule
Emp. Form.C30H28F2N6O4
Mol. Mass.574.5779
SMILESCCOc1cc(F)c(Cn2nc(-c3ncc(OCC4(CO)COC4)c(Nc4ccncc4)n3)c3ccccc23)c(F)c1