Reaction Details
TargetMitotic checkpoint serine/threonine-protein kinase BUB1
LigandBDBM379083
Substrate/Competitorn/a
Meas. Tech.Bub1 Kinase Assay
IC50 5.40±n/a nM
Citation Hitchcock, MMengel, APütter, VSiemeister, GWengner, AMBriem, HEis, KSchulze, VFernandez-Montalvan, AEPrechtl, SHolton, SFanghänel, JLienau, PPreusse, CGnoth, MJ Substituted benzylindazoles for use as Bub1 kinase inhibitors in the treatment of hyperproliferative diseases US Patent US10266548 Publication Date 4/23/2019
 
Mitotic checkpoint serine/threonine-protein kinase BUB1
Name:Mitotic checkpoint serine/threonine-protein kinase BUB1
Type:PROTEIN
Mol. Mass.:122372.31
Organism:Homo sapiens (Human)
Description:ChEMBL_1510603
Residue:1085
BDBM379083
NameBDBM379083
Synonyms:4-({5-methoxy-2-[1- (4-propylbenzyl)- 1H-indazol-3- yl]pyrimidin-4- yl}amino)pyridine-3- carboxamide | US10266548, Example 25-2
TypeSmall organic molecule
Emp. Form.C28H27N7O2
Mol. Mass.493.5597
SMILESCCCc1ccc(Cn2nc(-c3ncc(OC)c(Nc4ccncc4C(N)=O)n3)c3ccccc23)cc1