Reaction Details
TargetMitotic checkpoint serine/threonine-protein kinase BUB1
LigandBDBM379085
Substrate/Competitorn/a
Meas. Tech.Bub1 Kinase Assay
IC50 5.03±n/a nM
Citation Hitchcock, MMengel, APütter, VSiemeister, GWengner, AMBriem, HEis, KSchulze, VFernandez-Montalvan, AEPrechtl, SHolton, SFanghänel, JLienau, PPreusse, CGnoth, MJ Substituted benzylindazoles for use as Bub1 kinase inhibitors in the treatment of hyperproliferative diseases US Patent US10266548 Publication Date 4/23/2019
 
Mitotic checkpoint serine/threonine-protein kinase BUB1
Name:Mitotic checkpoint serine/threonine-protein kinase BUB1
Type:PROTEIN
Mol. Mass.:122372.31
Organism:Homo sapiens (Human)
Description:ChEMBL_1510603
Residue:1085
BDBM379085
NameBDBM379085
Synonyms:4-({2-[1-(2,6- difluoro-4- hydroxybenzyl)-1H- indazol-3-yl]-5- methoxypyrimidin-4- yl}amino)pyridine-3- carboxamide | US10266548, Example 25-4
TypeSmall organic molecule
Emp. Form.C25H19F2N7O3
Mol. Mass.503.4603
SMILESCOc1cnc(nc1Nc1ccncc1C(N)=O)-c1nn(Cc2c(F)cc(O)cc2F)c2ccccc12