Reaction Details
TargetTrifunctional purine biosynthetic protein adenosine-3
LigandBDBM24687
Substrate/CompetitorBDBM22589
Meas. Tech.GAR Tfase Activity Assay
pH7.5±n/a
Temperature299.15±n/a K
Ki 1100±n/a nM
Citation DeMartino, JKHwang, IConnelly, SWilson, IABoger, DL Asymmetric synthesis of inhibitors of glycinamide ribonucleotide transformylase. J Med Chem51:5441-8 (2008) 
 
Trifunctional purine biosynthetic protein adenosine-3
Name:Trifunctional purine biosynthetic protein adenosine-3
Type:Protein
Mol. Mass.:107768.47
Organism:Homo sapiens (Human)
Description:P22102
Residue:1010
BDBM24687
BDBM22589
NameBDBM24687
Synonyms:10-hydroxy-DDACTHF, 10R-7 | 2-({4-[(1R)-4-(2,4-diamino-6-oxo-1,6-dihydropyrimidin-5-yl)-1-hydroxybutyl]phenyl}formamido)pentanedioic acid
TypeSmall organic molecule
Emp. Form.C20H25N5O7
Mol. Mass.447.4418
SMILESNc1nc(N)c(CCC[C@@H](O)c2ccc(cc2)C(=O)NC(CCC(O)=O)C(O)=O)c(=O)[nH]1