Reaction Details
TargetTransthyretin
LigandBDBM85507
Substrate/Competitorn/a
Meas. Tech.The FP assay
IC50 289±n/a nM
Citation Graef, IAAlhamadsheh, MM Identification of stabilizers of multimeric proteins US Patent US10278929 Publication Date 5/7/2019
 
Transthyretin
Name:Transthyretin
Type:Enzyme
Mol. Mass.:15884.31
Organism:Homo sapiens (Human)
Description:P02766
Residue:147
BDBM85507
NameBDBM85507
Synonyms:CAS_4394-00-7 Niflumic acid US10278929, Niflumic acid US20240002326, Compound Niflumic acid
TypeSmall organic molecule
Emp. Form.C13H9F3N2O2
Mol. Mass.282.218
SMILESOC(=O)c1cccnc1Nc1cccc(c1)C(F)(F)F