Reaction Details
TargetBeta-1 adrenergic receptor
LigandBDBM25765
Substrate/CompetitorBDBM25747
Meas. Tech.3H-CGP 12177 Whole Cell Binding Assay
pH7.4±n/a
Temperature310.15±n/a K
Kd 3.1±.3 nM
Citation Baker, JG The selectivity of beta-adrenoceptor antagonists at the human beta1, beta2 and beta3 adrenoceptors. Br J Pharmacol144:317-22 (2005) 
 
Beta-1 adrenergic receptor
Name:Beta-1 adrenergic receptor
Type:G Protein-Coupled Receptor (GPCR)
Mol. Mass.:51338.40
Organism:Homo sapiens (Human)
Description:P08588
Residue:477
BDBM25765
BDBM25747
NameBDBM25765
Synonyms:Bupranolol Ophtorenin | tert-butyl[3-(2-chloro-5-methylphenoxy)-2-hydroxypropyl]amine
TypeSmall organic molecule
Emp. Form.C14H22ClNO2
Mol. Mass.271.783
SMILESCc1ccc(Cl)c(OCC(O)CNC(C)(C)C)c1