Reaction Details
TargetBeta-1 adrenergic receptor
LigandBDBM25771
Substrate/CompetitorBDBM25747
Meas. Tech.3H-CGP 12177 Whole Cell Binding Assay
pH7.4±n/a
Temperature310.15±n/a K
Kd 4169±97 nM
Citation Baker, JG The selectivity of beta-adrenoceptor antagonists at the human beta1, beta2 and beta3 adrenoceptors. Br J Pharmacol144:317-22 (2005) 
 
Beta-1 adrenergic receptor
Name:Beta-1 adrenergic receptor
Type:G Protein-Coupled Receptor (GPCR)
Mol. Mass.:51338.40
Organism:Homo sapiens (Human)
Description:P08588
Residue:477
BDBM25771
BDBM25747
NameBDBM25771
Synonyms:1-hydroxy-2-naphthoic acid;4-[1-hydroxy-2-[6-(4-phenylbutoxy)hexylamino]ethyl]-2-methylol-phenol Aeromax Serevent | salmeterol xinafoate
TypeSmall organic molecule
Emp. Form.C25H37NO4
Mol. Mass.415.5656
SMILESOCc1cc(ccc1O)C(O)CNCCCCCCOCCCCc1ccccc1