Reaction Details
TargetBeta-2 adrenergic receptor
LigandBDBM25754
Substrate/CompetitorBDBM25747
Meas. Tech.3H-CGP 12177 Whole Cell Binding Assay
Kd 1380±n/a nM
Citation Baker, JG The selectivity of beta-adrenoceptor antagonists at the human beta1, beta2 and beta3 adrenoceptors. Br J Pharmacol144:317-22 (2005) 
 
Beta-2 adrenergic receptor
Name:Beta-2 adrenergic receptor
Type:n/a
Mol. Mass.:46461.69
Organism:Homo sapiens (Human)
Description:P07550
Residue:413
BDBM25754
BDBM25747
NameBDBM25754
Synonyms:2-[4-(2-{[(2R)-2-hydroxy-3-phenoxypropyl]amino}ethoxy)phenoxy]acetic acid | ICI 215001
TypeSmall organic molecule
Emp. Form.C19H23NO6
Mol. Mass.361.389
SMILESO[C@H](CNCCOc1ccc(OCC(O)=O)cc1)COc1ccccc1