Reaction Details
TargetBeta-2 adrenergic receptor
LigandBDBM25747
Substrate/CompetitorBDBM25747
Meas. Tech.3H-CGP 12177 Whole Cell Binding Assay
Kd 0.41±n/a nM
Citation Baker, JG The selectivity of beta-adrenoceptor antagonists at the human beta1, beta2 and beta3 adrenoceptors. Br J Pharmacol144:317-22 (2005) 
 
Beta-2 adrenergic receptor
Name:Beta-2 adrenergic receptor
Type:n/a
Mol. Mass.:46461.69
Organism:Homo sapiens (Human)
Description:P07550
Residue:413
BDBM25747
BDBM25747
NameBDBM25747
Synonyms:4-[3-(tert-butylamino)-2-hydroxypropoxy]-2,3-dihydro-1H-1,3-benzodiazol-2-one hydrochloride CGP-12177 [3H]CGP 12177
Typeradiolabeled ligand
Emp. Form.C14H21N3O3
Mol. Mass.279.3348
SMILESCC(C)(C)NCC(O)COc1cccc2[nH]c(=O)[nH]c12