Reaction Details
TargetBeta-2 adrenergic receptor
LigandBDBM25758
Substrate/CompetitorBDBM25747
Meas. Tech.3H-CGP 12177 Whole Cell Binding Assay
Kd 9.3±n/a nM
Citation Baker, JG The selectivity of beta-adrenoceptor antagonists at the human beta1, beta2 and beta3 adrenoceptors. Br J Pharmacol144:317-22 (2005) 
 
Beta-2 adrenergic receptor
Name:Beta-2 adrenergic receptor
Type:n/a
Mol. Mass.:46461.69
Organism:Homo sapiens (Human)
Description:P07550
Residue:413
BDBM25758
BDBM25747
NameBDBM25758
Synonyms:2-hydroxy-5-{1-hydroxy-2-[(4-phenylbutan-2-yl)amino]ethyl}benzamide Labetolol labetalol
TypeSmall organic molecule
Emp. Form.C19H24N2O3
Mol. Mass.328.4055
SMILESCC(CCc1ccccc1)NCC(O)c1ccc(O)c(c1)C(N)=O