Reaction Details
TargetBeta-2 adrenergic receptor
LigandBDBM25770
Substrate/CompetitorBDBM25747
Meas. Tech.3H-CGP 12177 Whole Cell Binding Assay
Kd 2399±n/a nM
Citation Baker, JG The selectivity of beta-adrenoceptor antagonists at the human beta1, beta2 and beta3 adrenoceptors. Br J Pharmacol144:317-22 (2005) 
 
Beta-2 adrenergic receptor
Name:Beta-2 adrenergic receptor
Type:n/a
Mol. Mass.:46461.69
Organism:Homo sapiens (Human)
Description:P07550
Residue:413
BDBM25770
BDBM25747
NameBDBM25770
Synonyms:5-[2-(tert-butylamino)-1-hydroxyethyl]benzene-1,3-diol Brethaire Bricanyl Terbutaline,(+/-)
TypeSmall organic molecule
Emp. Form.C12H19NO3
Mol. Mass.225.2842
SMILESCC(C)(C)NCC(O)c1cc(O)cc(O)c1