Reaction Details
TargetCarbonic anhydrase 13
LigandBDBM13058
Substrate/CompetitorBDBM10856
Meas. Tech.CA Inhibition Assay
Ki 1050±n/a nM
Citation Temperini, CInnocenti, AScozzafava, ASupuran, CT Carbonic anhydrase inhibitors. Interaction of the antitumor sulfamate EMD 486019 with twelve mammalian carbonic anhydrase isoforms: Kinetic and X-ray crystallographic studies. Bioorg Med Chem Lett18:4282-6 (2008) 
 
Carbonic anhydrase 13
Name:Carbonic anhydrase 13
Type:Enzyme
Mol. Mass.:29522.80
Organism:Mus musculus (mouse)
Description:Murine cloned isozyme
Residue:262
BDBM13058
BDBM10856
NameBDBM13058
Synonyms:6-oxo-6,7,8,9,10,11-hexahydrocyclohepta[c]chromen-3-yl sulfamate 667COUMATE CHEMBL286738 STX64 | {9-oxo-8-oxatricyclo[8.5.0.0^{2,7}]pentadeca-1(10),2(7),3,5-tetraen-5-yl} sulfamate
TypeSmall organic molecule
Emp. Form.C14H15NO5S
Mol. Mass.309.338
SMILESNS(=O)(=O)Oc1ccc2c3CCCCCc3c(=O)oc2c1