Reaction Details
TargetCarbonic anhydrase 5B, mitochondrial
LigandBDBM25902
Substrate/CompetitorBDBM10856
Meas. Tech.CA Inhibition Assay
Ki 322±n/a nM
Citation Temperini, CCecchi, AScozzafava, ASupuran, CT Carbonic anhydrase inhibitors. Interaction of indapamide and related diuretics with 12 mammalian isozymes and X-ray crystallographic studies for the indapamide-isozyme II adduct. Bioorg Med Chem Lett18:2567-73 (2008) 
 
Carbonic anhydrase 5B, mitochondrial
Name:Carbonic anhydrase 5B, mitochondrial
Type:Enzyme
Mol. Mass.:36440.83
Organism:Homo sapiens (Human)
Description:Human (cloned) isozyme
Residue:317
BDBM25902
BDBM10856
NameBDBM25902
Synonyms:4-chloro-2-[(furan-2-ylmethyl)amino]-5-sulfamoylbenzoic acid Frusemide Furosemide Furosemide, 4 US10172837, Furosemide
TypeSmall organic molecule
Emp. Form.C12H11ClN2O5S
Mol. Mass.330.744
SMILESNS(=O)(=O)c1cc(C(O)=O)c(NCc2ccco2)cc1Cl