Reaction Details
TargetCarbonic anhydrase 5B, mitochondrial
LigandBDBM25903
Substrate/CompetitorBDBM10856
Meas. Tech.CA Inhibition Assay
Ki 159±n/a nM
Citation Temperini, CCecchi, AScozzafava, ASupuran, CT Carbonic anhydrase inhibitors. Interaction of indapamide and related diuretics with 12 mammalian isozymes and X-ray crystallographic studies for the indapamide-isozyme II adduct. Bioorg Med Chem Lett18:2567-73 (2008) 
 
Carbonic anhydrase 5B, mitochondrial
Name:Carbonic anhydrase 5B, mitochondrial
Type:Enzyme
Mol. Mass.:36440.83
Organism:Homo sapiens (Human)
Description:Human (cloned) isozyme
Residue:317
BDBM25903
BDBM10856
NameBDBM25903
Synonyms:3-(butylamino)-4-phenoxy-5-sulfamoylbenzoic acid Bumex Fordiuran | cid_2471
TypeSmall organic molecule
Emp. Form.C17H20N2O5S
Mol. Mass.364.416
SMILESCCCCNc1cc(cc(c1Oc1ccccc1)S(N)(=O)=O)C(O)=O