Reaction Details
TargetCarbonic anhydrase 6
LigandBDBM25901
Substrate/CompetitorBDBM10856
Meas. Tech.CA Inhibition Assay
Ki 1606±n/a nM
Citation Temperini, CCecchi, AScozzafava, ASupuran, CT Carbonic anhydrase inhibitors. Interaction of indapamide and related diuretics with 12 mammalian isozymes and X-ray crystallographic studies for the indapamide-isozyme II adduct. Bioorg Med Chem Lett18:2567-73 (2008) 
 
Carbonic anhydrase 6
Name:Carbonic anhydrase 6
Type:Enzyme
Mol. Mass.:35371.40
Organism:Homo sapiens (Human)
Description:P23280
Residue:308
BDBM25901
BDBM10856
NameBDBM25901
Synonyms:4-chloro-N-(2-methyl-2,3-dihydro-1H-indol-1-yl)-3-sulfamoylbenzamide Indapamide Lozol | Noranat
TypeSmall organic molecule
Emp. Form.C16H16ClN3O3S
Mol. Mass.365.835
SMILESCC1Cc2ccccc2N1NC(=O)c1ccc(Cl)c(c1)S(N)(=O)=O