Reaction Details
TargetCarbonic anhydrase 13
LigandBDBM25897
Substrate/CompetitorBDBM10856
Meas. Tech.CA Inhibition Assay
Ki 15400±n/a nM
Citation Temperini, CCecchi, AScozzafava, ASupuran, CT Carbonic anhydrase inhibitors. Interaction of indapamide and related diuretics with 12 mammalian isozymes and X-ray crystallographic studies for the indapamide-isozyme II adduct. Bioorg Med Chem Lett18:2567-73 (2008) 
 
Carbonic anhydrase 13
Name:Carbonic anhydrase 13
Type:Enzyme
Mol. Mass.:29522.80
Organism:Mus musculus (mouse)
Description:Murine cloned isozyme
Residue:262
BDBM25897
BDBM10856
NameBDBM25897
Synonyms:1,1-dioxo-6-(trifluoromethyl)-3,4-dihydro-2H-1,2,4-benzothiadiazine-7-sulfonamide Diuredemina Hydroflumethiazide | cid_3647
TypeSmall organic molecule
Emp. Form.C8H8F3N3O4S2
Mol. Mass.331.292
SMILESNS(=O)(=O)c1cc2c(NCNS2(=O)=O)cc1C(F)(F)F