Reaction Details
TargetCarbonic anhydrase 14
LigandBDBM25899
Substrate/CompetitorBDBM10856
Meas. Tech.CA Inhibition Assay
Ki 5432±n/a nM
Citation Temperini, CCecchi, AScozzafava, ASupuran, CT Carbonic anhydrase inhibitors. Interaction of indapamide and related diuretics with 12 mammalian isozymes and X-ray crystallographic studies for the indapamide-isozyme II adduct. Bioorg Med Chem Lett18:2567-73 (2008) 
 
Carbonic anhydrase 14
Name:Carbonic anhydrase 14
Type:Enzyme
Mol. Mass.:37665.67
Organism:Homo sapiens (Human)
Description:Human (cloned) isozyme.
Residue:337
BDBM25899
BDBM10856
NameBDBM25899
Synonyms:7-chloro-2-methyl-3-(2-methylphenyl)-4-oxo-1,2,3,4-tetrahydroquinazoline-6-sulfonamide Metolazone Zaroxolyn
TypeSmall organic molecule
Emp. Form.C16H16ClN3O3S
Mol. Mass.365.835
SMILESCC1Nc2cc(Cl)c(cc2C(=O)N1c1ccccc1C)S(N)(=O)=O