Reaction Details
TargetCarbonic anhydrase 5B, mitochondrial
LigandBDBM25916
Substrate/CompetitorBDBM10856
Meas. Tech.CA Inhibition Assay
Ki 672±n/a nM
Citation Güzel, OInnocenti, AScozzafava, ASalman, AParkkila, SHilvo, MSupuran, CT Carbonic anhydrase inhibitors: synthesis and inhibition studies against mammalian isoforms I-XV with a series of 2-(hydrazinocarbonyl)-3-substituted-phenyl-1H-indole-5-sulfonamides. Bioorg Med Chem16:9113-20 (2008) 
 
Carbonic anhydrase 5B, mitochondrial
Name:Carbonic anhydrase 5B, mitochondrial
Type:Enzyme
Mol. Mass.:36440.83
Organism:Homo sapiens (Human)
Description:Human (cloned) isozyme
Residue:317
BDBM25916
BDBM10856
NameBDBM25916
Synonyms:3-(4-bromophenyl)-2-(hydrazinecarbonyl)-1H-indole-5-sulfonamide indole sulfonamide, 8l
TypeSmall organic molecule
Emp. Form.C15H13BrN4O3S
Mol. Mass.409.258
SMILESNNC(=O)c1[nH]c2ccc(cc2c1-c1ccc(Br)cc1)S(N)(=O)=O